Beta Release 52


#1

Beta Release 52 includes up to Developer Release 7030. It includes a protocol change, so you’ll need to update in order to visit domains running this version.

  • Allow specified users/groups to replace domain content from within Interface
    ** Quickly get up and running with a new set of content for your Sandbox. This feature allows domain owners to easily replace their domain’s content with Sandbox Starters from the High Fidelity Marketplace
  • You can now take snapshots from the Spectator Camera app
  • Correct create desktop icon name
  • Added Assets for Web Browser MP Script
  • Opened up setForceFaceTrackerConnected
  • Remove context overlay (if present) when removing entity
  • Create a Skybox Changer
  • Fixed unable to select items in a TreeView
  • Fix drawInFront overlays only rendering in left eye
  • Fixing the graphics setting for Ambient Occlusion
  • Use tight fitting avatar collision primitives to prevent hand IK targets from entering the torso.
  • Fix for incorrectly sized avatar capsule collision
  • Miscellaneous logging fixes

#2

Waiting for the download to show up on steam, the announcement was made at 1:46pm on steam. But Beta 52 has yet to show up. Uninstalled & Reinstalled from steam to no avail, will keep trying.

Also this is the second week that the steam announcement & High Fidelity download website version numbers do not match. I have commented on both Beta 51 & Beta 52 on steam. Also on this post. HiFi download page says 7044. Thank you :smiley:


#3

2:51pm Beta 52 installed from steam. I can confirm it is 7044 & not 7030. Thx again.


#4

Compiling from GIT, after a make clean, make all halts with the tail: :cry:

In file included from /usr/include/x86_64-linux-gnu/qt5/QtCore/qobject.h:54:0,
                 from /usr/include/x86_64-linux-gnu/qt5/QtCore/qsharedpointer_impl.h:64,
                 from /usr/include/x86_64-linux-gnu/qt5/QtCore/qsharedpointer.h:48,
                 from /usr/include/x86_64-linux-gnu/qt5/QtScript/qscriptvalue.h:30,
                 from /usr/include/x86_64-linux-gnu/qt5/QtScript/QScriptValue:1,
                 from /usr/src/hifi/libraries/shared/src/PointerEvent.h:19,
                 from /usr/src/hifi/libraries/shared/src/PointerEvent.cpp:12:
/usr/src/hifi/libraries/shared/src/RegisteredMetaTypes.h:37:25: error: ‘function’ is not a member of ‘std’
 Q_DECLARE_METATYPE(std::function<void()>);
                         ^
/usr/src/hifi/libraries/shared/src/RegisteredMetaTypes.h:37:25: note: suggested alternative: ‘is_function’
/usr/src/hifi/libraries/shared/src/RegisteredMetaTypes.h:37:25: error: ‘function’ is not a member of ‘std’
/usr/src/hifi/libraries/shared/src/RegisteredMetaTypes.h:37:25: note: suggested alternative: ‘is_function’
/usr/src/hifi/libraries/shared/src/RegisteredMetaTypes.h:37:40: error: template argument 1 is invalid
 Q_DECLARE_METATYPE(std::function<void()>);
                                        ^
/usr/src/hifi/libraries/shared/src/RegisteredMetaTypes.h:37:1: error: expected unqualified-id before ‘>’ token
 Q_DECLARE_METATYPE(std::function<void()>);
 ^
/usr/src/hifi/libraries/shared/src/RegisteredMetaTypes.h:38:25: error: ‘function’ is not a member of ‘std’
 Q_DECLARE_METATYPE(std::function<QVariant()>);
                         ^
/usr/src/hifi/libraries/shared/src/RegisteredMetaTypes.h:38:25: note: suggested alternative: ‘is_function’
/usr/src/hifi/libraries/shared/src/RegisteredMetaTypes.h:38:25: error: ‘function’ is not a member of ‘std’
/usr/src/hifi/libraries/shared/src/RegisteredMetaTypes.h:38:25: note: suggested alternative: ‘is_function’
/usr/src/hifi/libraries/shared/src/RegisteredMetaTypes.h:38:44: error: template argument 1 is invalid
 Q_DECLARE_METATYPE(std::function<QVariant()>);
                                            ^
/usr/src/hifi/libraries/shared/src/RegisteredMetaTypes.h:38:1: error: expected unqualified-id before ‘>’ token
 Q_DECLARE_METATYPE(std::function<QVariant()>);
 ^
libraries/shared/CMakeFiles/shared.dir/build.make:734: recipe for target 'libraries/shared/CMakeFiles/shared.dir/src/PointerEvent.cpp.o' failed
make[2]: *** [libraries/shared/CMakeFiles/shared.dir/src/PointerEvent.cpp.o] Error 1
CMakeFiles/Makefile2:534: recipe for target 'libraries/shared/CMakeFiles/shared.dir/all' failed
make[1]: *** [libraries/shared/CMakeFiles/shared.dir/all] Error 2
Makefile:151: recipe for target 'all' failed
make: *** [all] Error 2

Could be a new dependency.
Looks like I am on GCC 7.1 now too.
Hints welcome. :smile:


#5

Definitely a GCC/G++7 compatibility issue. I forced the system back to 6 and it is compiling happily.


#6

This topic was automatically closed after 30 days. New replies are no longer allowed.